{"text_format":"1","workbook":"xlsx","n_sheets":15,"sheets":["HOME","UI Tenaga Listrik","UI Bahan Bakar","UI Biomassa","Status Emisi","Referensi","SIH","FE BB Stasioner","FE BB Gerak","FE Listrik","Nilai Kalor_NCV","Density","Nilai Kalor_NCV kg","List Kota","List BBM"],"not_rendered":{"charts":0,"images":36,"macros":1,"external_links":0,"defined_names":9,"comments":0,"pivot_tables":0},"unopened":[],"bounds":{"document_bytes":16777216,"sheet_cells":100000,"rows_first":2000,"rows_last":500,"rows_between":2000,"halvings":0,"cell_chars":16384,"cell_head_chars":4096},"cells_cut":0,"cells_raw":0,"read":"whole","date_system":"1900"}

{"sheet":"HOME","index":0,"n_rows":12,"n_cols":8,"rows_kept":12,"cut":false,"hidden":false,"merged":[[4,2,4,5],[5,2,5,5]]}
[]
[]
[]
[]
[]
[null,null,"SUMBER ENERGI APA YANG ANDA GUNAKAN ?"]
[]
[]
[]
[null,null,null,null,null,null,null,"Attention/Perhatian:"]
[null,null,null,null,null,null,null,"mohon enable macros anda"]
[null,null,null,null,null,null,null,"zoom level pada 86%"]

{"sheet":"UI Tenaga Listrik","index":1,"n_rows":33,"n_cols":7,"rows_kept":33,"cut":false,"hidden":true,"merged":[]}
[]
[]
[]
[]
[null,null,"Sumber Energi",null,"Tenaga Listrik"]
[]
[null,null,"Lokasi Industri/Grid Pembangkit",null,"Lambuya - Sulawesi Tenggara"]
[]
[null,null,"Faktor Emisi CO2 (Listrik)",null,{"$f":"IFERROR(VLOOKUP(E7,'FE Listrik'!A4:B111,2,FALSE),\"0\")","v":"0,56"},null,"  kg GRK/kWh"]
[]
[null,null,"Faktor Emisi CH4 (Listrik)",null,0,null,"  kg GRK/kWh"]
[]
[null,null,"Faktor Emisi N2O (Listrik)",null,0,null,"  kg GRK/kWh"]
[]
[null,null,"Konsumsi Energi Listrik (per bulan)",null,null,null,"  kWh"]
{"$rows_left_out":19}
{"sheet":"UI Bahan Bakar","index":2,"n_rows":55,"n_cols":11,"rows_kept":55,"cut":false,"hidden":true,"merged":[]}
[]
[]
[]
[]
[null,null,"Sumber Energi",null,"Bahan Bakar Fossil"]
[null,null,null,null,null,null,null,null,null,null," "]
[null,null,"Tipe Equipment",null,"Tak Bergerak"]
[]
[null,null,"Jenis Sumber Energi Bergerak"]
[]
[null,null,"Jenis Sumber Energi Tak Bergerak"]
[]
[null,null,"Faktor Emisi CO2 (Bergerak)",null,{"$f":"IFERROR(VLOOKUP(E9,'FE BB Gerak'!A3:B20,2,FALSE),\"0\")","v":"0"},null,"  kg GRK/TJ"]
[]
[null,null,"Faktor Emisi CH4 (Bergerak)",null,{"$f":"IFERROR(VLOOKUP(E9,'FE BB Gerak'!A3:C20,3,FALSE),\"0\")","v":"0"},null,"  kg GRK/TJ"]
{"$rows_left_out":41}
{"sheet":"UI Biomassa","index":3,"n_rows":49,"n_cols":7,"rows_kept":49,"cut":false,"hidden":true,"merged":[]}
[]
[]
[]
[]
[null,null,"Sumber Energi",null,"Biomassa"]
[]
[null,null,"Tipe Equipment",null,"Tak Bergerak"]
[]
[null,null,"Jenis Biomassa"]
[]
[null,null,"Faktor Emisi CO2 (Tak Bergerak)",null,{"$f":"IFERROR(VLOOKUP($E$9,'FE BB Stasioner'!$A$49:$B$53,2,FALSE),\"0\")","v":"0"},null,"  kg GRK/TJ"]
[]
[null,null,"Faktor Emisi CH4 (Tak Bergerak)",null,{"$f":"IFERROR(VLOOKUP($E$9,'FE BB Stasioner'!$A$49:$C$53,3,FALSE),\"0\")","v":"0"},null,"  kg GRK/TJ"]
[]
[null,null,"Faktor Emisi N2O (Tak Bergerak)",null,{"$f":"IFERROR(VLOOKUP(E9,'FE BB Stasioner'!A49:D53,4,FALSE),\"0\")","v":"0"},null,"  kg GRK/TJ"]
{"$rows_left_out":35}
{"sheet":"Status Emisi","index":4,"n_rows":60,"n_cols":7,"rows_kept":60,"cut":false,"hidden":true,"merged":[]}
[]
[]
[]
[]
[null,null,"Jenis Industri"]
[]
[null,null,{"$f":"IF(E5=\"Gula Kristal Putih\",\"Bahan Baku Tebu yang Digunakan\",\"Produk yang Dihasilkan per Bulan\")","v":"Produk yang Dihasilkan per Bulan"},null,null,null,{"$f":"IFERROR(VLOOKUP(E5,SIH!$A$2:$F$50,6,FALSE),\"  ton\")","v":"  ton"}]
[]
[null,null,"Emisi yang Dihasilkan per Bulan dari Produksi",null,null,null,"  kg CO2e"]
[]
[null,null,"Batas Emisi CO2e Industri (kg CO2e / sat. produk)",null,{"$f":"IFERROR(VLOOKUP(E5,SIH!$A$2:$D$50,4,FALSE),\"0\")","v":"0"},null,{"$f":"CONCATENATE(\"  kg CO2e /\",G7)","v":"  kg CO2e /  ton"}]
[]
[null,null,"Peraturan Acuan Batas Emisi",null,{"$f":"IFERROR(VLOOKUP(E5,SIH!$A$2:$E$50,5,FALSE),\"\")","v":""}]
[]
[]
{"$rows_left_out":46}
{"sheet":"Referensi","index":5,"n_rows":74,"n_cols":17,"rows_kept":74,"cut":false,"hidden":true,"merged":[[2,2,2,26]]}
[]
[]
[null,null,"ACUAN DAN REFERENSI"]
[]
[null,null,"PERTIMBANGAN PENENTUAN PEMILIHAN PENDEKATAN TIER 1",null,null,null,null,null,null,null,null,null,null,null,null,"RUMUS YANG DIGUNAKAN DALAM PERHITUNGAN"]
[null,null,"SOURCE : 2006 IPCC GUIDELINES FOR NATIONAL GREENHOUSE GAS INVENTORIES, PEDOMAN INVENTARISASI GRK KLHK 2012",null,null,null,null,null,null,null,null,null,null,null,null,"SOURCE : 2006 IPCC GUIDELINES FOR NATIONAL GREENHOUSE GAS INVENTORIES, PEDOMAN INVENTARISASI GRK KLHK 2012"]
[]
[]
[]
[]
[]
[]
[]
[]
[]
{"$rows_left_out":60}
{"sheet":"SIH","index":6,"n_rows":50,"n_cols":12,"rows_kept":50,"cut":false,"hidden":true,"merged":[]}
["SIH","Sat","Bahan / Metode Produksi","Maksimum / ton Produk","No Permenperin","Satuan","Ket.",null,null,null,{"$f":"COUNTIF($L:$L,\"?*\")","v":49}]
["Tas, Kantong Plastik, Bioplastik bahan Polimer","kg CO2/ton","Polimer",440,"PERMENPERIN NO. 55 TAHUN 2020","  ton",null,null,{"$f":"IF(ISNUMBER(SEARCH('Status Emisi'!$E$5,SIH!J2)),MAX($I$1:I1)+1,0)","v":1},"Tas, Kantong Plastik, Bioplastik bahan Polimer",{"$f":"OFFSET($L$2,0,0,COUNTIF(L:L,\"?*\"),1)","v":"Tas, Kantong Plastik, Bioplastik bahan Polimer"},{"$f":"IFERROR(VLOOKUP(ROWS($L$1:L1),$I$2:$J$50,2,FALSE),\"\")","v":"Tas, Kantong Plastik, Bioplastik bahan Polimer"}]
["Tas, Kantong Plastik, Bioplastik bahan Daur Ulang","kg CO2/ton","Daur Ulang",560,"PERMENPERIN NO. 55 TAHUN 2020","  ton",null,null,{"$f":"IF(ISNUMBER(SEARCH('Status Emisi'!$E$5,SIH!J3)),MAX($I$1:I2)+1,0)","v":2},"Tas, Kantong Plastik, Bioplastik bahan Daur Ulang",null,{"$f":"IFERROR(VLOOKUP(ROWS($L$1:L2),$I$2:$J$50,2,FALSE),\"\")","v":"Tas, Kantong Plastik, Bioplastik bahan Daur Ulang"}]
["Tas, Kantong Plastik, Bioplastik bahan Biopolimer","kg CO2/ton","Biopolimer",560,"PERMENPERIN NO. 55 TAHUN 2020","  ton",null,null,{"$f":"IF(ISNUMBER(SEARCH('Status Emisi'!$E$5,SIH!J4)),MAX($I$1:I3)+1,0)","v":3},"Tas, Kantong Plastik, Bioplastik bahan Biopolimer",null,{"$f":"IFERROR(VLOOKUP(ROWS($L$1:L3),$I$2:$J$50,2,FALSE),\"\")","v":"Tas, Kantong Plastik, Bioplastik bahan Biopolimer"}]
["Pupuk Nitrogen, Phospor, Kalium Padat (Fusion Granulation)","kg CO2/ton","Fusion Granulation",117,"PERMENPERIN NO. 50 TAHUN 2020","  ton",null,null,{"$f":"IF(ISNUMBER(SEARCH('Status Emisi'!$E$5,SIH!J5)),MAX($I$1:I4)+1,0)","v":4},"Pupuk Nitrogen, Phospor, Kalium Padat (Fusion Granulation)",null,{"$f":"IFERROR(VLOOKUP(ROWS($L$1:L4),$I$2:$J$50,2,FALSE),\"\")","v":"Pupuk Nitrogen, Phospor, Kalium Padat (Fusion Granulation)"}]
["Pupuk Nitrogen, Phospor, Kalium Padat (Chemical Granulation)",null,"Chemical Granulation",80,"PERMENPERIN NO. 50 TAHUN 2020","  ton",null,null,{"$f":"IF(ISNUMBER(SEARCH('Status Emisi'!$E$5,SIH!J6)),MAX($I$1:I5)+1,0)","v":5},"Pupuk Nitrogen, Phospor, Kalium Padat (Chemical Granulation)",null,{"$f":"IFERROR(VLOOKUP(ROWS($L$1:L5),$I$2:$J$50,2,FALSE),\"\")","v":"Pupuk Nitrogen, Phospor, Kalium Padat (Chemical Granulation)"}]
["Karet Remah (Crumb Rubber)","kg CO2/ton","-",200,"PERMENPERIN NO. 9 TAHUN 2019","  ton",null,null,{"$f":"IF(ISNUMBER(SEARCH('Status Emisi'!$E$5,SIH!J7)),MAX($I$1:I6)+1,0)","v":6},"Karet Remah (Crumb Rubber)",null,{"$f":"IFERROR(VLOOKUP(ROWS($L$1:L6),$I$2:$J$50,2,FALSE),\"\")","v":"Karet Remah (Crumb Rubber)"}]
["Penyamakan Kulit Sapi, Kerbau Domba Kambing","kg CO2/ton",null,0.9,"PERMENPERIN NO. 37 TAHUN 2019","  ft2",null,null,{"$f":"IF(ISNUMBER(SEARCH('Status Emisi'!$E$5,SIH!J8)),MAX($I$1:I7)+1,0)","v":7},"Penyamakan Kulit Sapi, Kerbau Domba Kambing",null,{"$f":"IFERROR(VLOOKUP(ROWS($L$1:L7),$I$2:$J$50,2,FALSE),\"\")","v":"Penyamakan Kulit Sapi, Kerbau Domba Kambing"}]
["Kaca Lembaran","kg CO2/ton","-",600,"PERMENPERIN NO. 12 TAHUN 2020","  ton",null,null,{"$f":"IF(ISNUMBER(SEARCH('Status Emisi'!$E$5,SIH!J9)),MAX($I$1:I8)+1,0)","v":8},"Kaca Lembaran",null,{"$f":"IFERROR(VLOOKUP(ROWS($L$1:L8),$I$2:$J$50,2,FALSE),\"\")","v":"Kaca Lembaran"}]
["Ubin Keramik Kategori BIIa, BIIb, BIII","kg CO2/ton","BIIa, BIIb, BIII",23000,"PERMENPERIN NO. 12 TAHUN 2019","  ton",null,null,{"$f":"IF(ISNUMBER(SEARCH('Status Emisi'!$E$5,SIH!J10)),MAX($I$1:I9)+1,0)","v":9},"Ubin Keramik Kategori BIIa, BIIb, BIII",null,{"$f":"IFERROR(VLOOKUP(ROWS($L$1:L9),$I$2:$J$50,2,FALSE),\"\")","v":"Ubin Keramik Kategori BIIa, BIIb, BIII"}]
["Ubin Keramik Kategori BIa, BIb","kg CO2/ton","BIa, BIb",18330,"PERMENPERIN NO. 12 TAHUN 2019","  ton",null,null,{"$f":"IF(ISNUMBER(SEARCH('Status Emisi'!$E$5,SIH!J11)),MAX($I$1:I10)+1,0)","v":10},"Ubin Keramik Kategori BIa, BIb",null,{"$f":"IFERROR(VLOOKUP(ROWS($L$1:L10),$I$2:$J$50,2,FALSE),\"\")","v":"Ubin Keramik Kategori BIa, BIb"}]
["Oleokimia Dasar bersumber Minyak Nabati","kg CO2/ton","-",1000,"PERMENPERIN NO. 31 TAHUN 2021","  ton",null,null,{"$f":"IF(ISNUMBER(SEARCH('Status Emisi'!$E$5,SIH!J12)),MAX($I$1:I11)+1,0)","v":11},"Oleokimia Dasar bersumber Minyak Nabati",null,{"$f":"IFERROR(VLOOKUP(ROWS($L$1:L11),$I$2:$J$50,2,FALSE),\"\")","v":"Oleokimia Dasar bersumber Minyak Nabati"}]
["Kopi Instan","kg CO2/ton",null,3750,"PERMENPERIN NO. 54 TAHUN 2020","  ton",null,null,{"$f":"IF(ISNUMBER(SEARCH('Status Emisi'!$E$5,SIH!J13)),MAX($I$1:I12)+1,0)","v":12},"Kopi Instan",null,{"$f":"IFERROR(VLOOKUP(ROWS($L$1:L12),$I$2:$J$50,2,FALSE),\"\")","v":"Kopi Instan"}]
["Barang Lainnya dari Kaca","kg CO2/ton","-",600,"PERMENPERIN NO. 30 TAHUN 2021","  ton",null,null,{"$f":"IF(ISNUMBER(SEARCH('Status Emisi'!$E$5,SIH!J14)),MAX($I$1:I13)+1,0)","v":13},"Barang Lainnya dari Kaca",null,{"$f":"IFERROR(VLOOKUP(ROWS($L$1:L13),$I$2:$J$50,2,FALSE),\"\")","v":"Barang Lainnya dari Kaca"}]
["Tepung Terigu Tanpa Peletisasi","kg CO2/ton","Tanpa Peletisasi",45,"PERMENPERIN NO. 32 TAHUN 2021","  ton",null,null,{"$f":"IF(ISNUMBER(SEARCH('Status Emisi'!$E$5,SIH!J15)),MAX($I$1:I14)+1,0)","v":14},"Tepung Terigu Tanpa Peletisasi",null,{"$f":"IFERROR(VLOOKUP(ROWS($L$1:L14),$I$2:$J$50,2,FALSE),\"\")","v":"Tepung Terigu Tanpa Peletisasi"}]
{"$rows_left_out":36}
{"sheet":"FE BB Stasioner","index":7,"n_rows":53,"n_cols":6,"rows_kept":53,"cut":false,"hidden":true,"merged":[[0,0,1,0],[0,1,0,3]]}
["Jenis Bahan Bakar","FE Default IPCC 2006 sumber tak Bergerak, kg/TJ"]
[null,"CO2","CH4","N2O"]
["Minyak Mentah",73300,3,0.6]
["Orimulsion",77000,3,0.6]
["LNG/CNG",64200,3,0.6]
["Premium",69300,3,0.6]
["Pertalite",69300,3,0.6]
["Pertamax",69300,3,0.6]
["Pertamax Plus/Turbo",69300,3,0.6]
["Avgas",70000,3,0.6]
["Avtur",70000,3,0.6]
["Kerosin Jet",71500,3,0.6]
["Kerosin Lain",71900,3,0.6]
["Shale oil",73300,3,0.6]
["Solar",74100,3,0.6]
{"$rows_left_out":39}
{"sheet":"FE BB Gerak","index":8,"n_rows":20,"n_cols":4,"rows_kept":20,"cut":false,"hidden":true,"merged":[[0,0,1,0],[0,1,0,3]]}
["Jenis Bahan Bakar","FE Default IPCC 2006 sumber Bergerak, kg/TJ"]
[null,"CO2","CH4","N2O"]
["LNG/CNG",56100,92,3]
["Premium",69300,33,3.2]
["Pertalite",69300,33,3.2]
["Pertamax",69300,33,3.2]
["Pertamax Plus/Turbo",69300,33,3.2]
["Avgas",70000,0.5,2]
["Avtur",71500,3,0.6]
["Kerosin Jet",71500,3,0.6]
["Kerosin Lain",71900,3,0.6]
["Solar",74100,3.9,3.9]
["Residu",77400,7,2]
["LPG",63100,62,0.2]
["Pelumas",73300,3,0.6]
{"$rows_left_out":6}
{"sheet":"FE Listrik","index":9,"n_rows":111,"n_cols":9,"rows_kept":111,"cut":false,"hidden":true,"merged":[[0,0,1,0],[0,6,1,6],[0,7,0,8],[0,2,1,2],[0,4,0,5],[0,3,1,3]]}
["Grid","Emission Factor (Gatrik ESDM 2019)","Provinsi","OM (CO2/MWh)","FE Data ESDM Gatrik, 2019 (kg CO2/kWh)",null,"OM (CO2/MWh)","FE Data ESDM Gatrik, 2019 (ton CO2/MWh)"]
[null,"OM Ex-Post (kg CO2/kWh)",null,null,"Ex-Post","Ex-Ante",null,"Ex-Post","Ex-Ante"]
[]
["Adonara - NTT","0,59","Bali","0,77","0,94","0,93",{"$f":"D4*1000","v":770},{"$f":"E4*1000","v":940},{"$f":"F4*1000","v":930}]
["Alor - NTT","0,58","Nusa Tenggara Timur","0,52","0,87","N/A",{"$f":"D5*1000","v":520},0,0]
["Ambon - Maluku","0,66","Kepulauan Riau","0,59","0,59","0,88",590,{"$f":"E6*1000","v":590},880]
["Bangka - Bangka Belitung","0,89","Nusa Tenggara Timur","0,58","0,58","0,58",580,580,580]
["Barito - Kalimantan Tengah","1,31","Maluku","0,65","0,66","0,66",650,660,660]
["Batam - Kep. Riau","0,82","Sulawesi Tengah","1,04","0,89","0,88",1040,890,880]
["Bau-Bau - Sulawesi Tenggara","0,74","Sulawesi Tengah","0,80","0,87","0,87",800,{"$f":"E10*1000","v":870},870]
["Belitung - Bangka Belitung","1,41","Bangka Belitung","1,20","1,31","1,28",1200,1310,1280]
["Bengkalis - Riau","0,01","Bengkulu","0,76","0,82","0,85",760,820,850]
["Biak - Papua","0,57","Kalimantan Tengah","0,97","0,74","0,67",970,740,670]
["Bima - NTB","0,55","Kepulauan Riau","1,40","1,41","1,46",1400,1410,1460]
["Bualemo - Sulawesi Tengah","0,71","Sulawesi Tenggara","0,01","0,01","0,01",10,10,10]
{"$rows_left_out":97}
{"sheet":"Nilai Kalor_NCV","index":10,"n_rows":12,"n_cols":3,"rows_kept":12,"cut":false,"hidden":true,"merged":[]}
["Jenis Bahan Bakar","Nilai Kalor (TJ/unit)","Penggunaan"]
["Premium (liter)",3.3000000000000003E-5,"Kendaraan Bermotor"]
["Pertamax (liter)",3.3000000000000003E-5,"Kendaraan Bermotor"]
["Pertamax Plus (liter)",3.3000000000000003E-5,"Kendaraan Bermotor"]
["Solar (HSD, ADO) (liter)",3.6000000000000001E-5,"Kendaraan Bermotor, Pembangkit"]
["Minyak Diesel (IDO) (liter)",3.8000000000000002E-5,"Boiler Industri"]
["Marine Fuel Oil (liter)",4.0000000000000003E-5,"Pembangkit Listrik"]
["Marine Fuel Oil (ton)",4.0399999999999998E-2,"Pembangkit Listrik"]
["Gas Bumi (SCF)",1.0550000000000001E-6,"Industri, rumah tangga, restoran"]
["Gas Bumi (Nm3)",3.8500000000000001E-5,"Industri, rumah tangga, restoran"]
["LPG (kg)",4.7299999999999998E-5,"Rumah tangga, restoran"]
["Batubara (ton)",1.89E-2,"Pembangkit Listrik, Industri"]

{"sheet":"Density","index":11,"n_rows":54,"n_cols":3,"rows_kept":54,"cut":false,"hidden":true,"merged":[]}
["Jenis Bahan Bakar","Density (kg/m3)","Density (kg/l)"]
["Minyak Mentah",840,0.84]
["Orimulsion",1200,1.2]
["LNG/CNG",468.1,0.46810000000000002]
["Premium",780,0.78]
["Pertalite",780,0.78]
["Pertamax",780,0.78]
["Pertamax Plus/Turbo",780,0.78]
["Avgas",721,0.72099999999999997]
["Avtur",810,0.81]
["Kerosin Jet",{"$f":"1615/2","v":807.5},0.8075]
["Kerosin Lain",786,0.78600000000000003]
["Shale oil",872.1,0.87209999999999999]
["Solar",832,0.83199999999999996]
["Residu",991,0.99099999999999999]
{"$rows_left_out":40}
{"sheet":"Nilai Kalor_NCV kg","index":12,"n_rows":52,"n_cols":2,"rows_kept":52,"cut":false,"hidden":true,"merged":[]}
["Jenis Bahan Bakar","Nilai Kalor (TJ/kg)"]
["Minyak Mentah",{"$f":"42.3/1000000","v":4.2299999999999998E-5}]
["Orimulsion",{"$f":"27.5/1000000","v":2.7500000000000001E-5}]
["LNG/CNG",{"$f":"44.2/1000000","v":4.4200000000000004E-5}]
["Premium",{"$f":"44.3/1000000","v":4.4299999999999999E-5}]
["Pertalite",{"$f":"44.3/1000000","v":4.4299999999999999E-5}]
["Pertamax",{"$f":"44.3/1000000","v":4.4299999999999999E-5}]
["Pertamax Plus/Turbo",4.4299999999999999E-5]
["Avgas",{"$f":"44.3/1000000","v":4.4299999999999999E-5}]
["Avtur",{"$f":"44.3/1000000","v":4.4299999999999999E-5}]
["Kerosin Jet",4.4100000000000001E-5]
["Kerosin Lain",{"$f":"43.8/1000000","v":4.3799999999999994E-5}]
["Shale oil",{"$f":"38.1/1000000","v":3.8100000000000005E-5}]
["Solar",{"$f":"43/1000000","v":4.3000000000000002E-5}]
["Residu",{"$f":"40.4/1000000","v":4.0399999999999999E-5}]
{"$rows_left_out":38}
{"sheet":"List Kota","index":13,"n_rows":109,"n_cols":9,"rows_kept":109,"cut":false,"hidden":true,"merged":[]}
["Sumber Energi",null,null,null,null,null,null,{"$f":"COUNTIF($I:$I,\"?*\")","v":1}]
["Bahan Bakar Fossil",null,null,null,null,{"$f":"IF(ISNUMBER(SEARCH('UI Tenaga Listrik'!$E$7,'List Kota'!G2)),MAX($F$1:F1)+1,0)","v":0},"Adonara - NTT",{"$f":"OFFSET($I$2,0,0,COUNTIF(I:I,\"?*\"),1)","v":"Lambuya - Sulawesi Tenggara"},{"$f":"IFERROR(VLOOKUP(ROWS($I$1:I1),$F$2:$G$109,2,FALSE),\"\")","v":"Lambuya - Sulawesi Tenggara"}]
["Biomassa",null,null,null,null,{"$f":"IF(ISNUMBER(SEARCH('UI Tenaga Listrik'!$E$7,'List Kota'!G3)),MAX($F$1:F2)+1,0)","v":0},"Alor - NTT",null,{"$f":"IFERROR(VLOOKUP(ROWS($I$1:I2),$F$2:$G$110,2,FALSE),\"\")","v":""}]
["Tenaga Listrik",null,null,null,null,{"$f":"IF(ISNUMBER(SEARCH('UI Tenaga Listrik'!$E$7,'List Kota'!G4)),MAX($F$1:F3)+1,0)","v":0},"Ambon - Maluku",null,{"$f":"IFERROR(VLOOKUP(ROWS($I$1:I3),$F$2:$G$110,2,FALSE),\"\")","v":""}]
[null,null,null,null,null,{"$f":"IF(ISNUMBER(SEARCH('UI Tenaga Listrik'!$E$7,'List Kota'!G5)),MAX($F$1:F4)+1,0)","v":0},"Bangka - Bangka Belitung",null,{"$f":"IFERROR(VLOOKUP(ROWS($I$1:I4),$F$2:$G$110,2,FALSE),\"\")","v":""}]
["Tipe Equipment",null,null,null,null,{"$f":"IF(ISNUMBER(SEARCH('UI Tenaga Listrik'!$E$7,'List Kota'!G6)),MAX($F$1:F5)+1,0)","v":0},"Barito - Kalimantan Tengah",null,{"$f":"IFERROR(VLOOKUP(ROWS($I$1:I5),$F$2:$G$110,2,FALSE),\"\")","v":""}]
["Tak Bergerak",null,null,null,null,{"$f":"IF(ISNUMBER(SEARCH('UI Tenaga Listrik'!$E$7,'List Kota'!G7)),MAX($F$1:F6)+1,0)","v":0},"Batam - Kep. Riau",null,{"$f":"IFERROR(VLOOKUP(ROWS($I$1:I6),$F$2:$G$110,2,FALSE),\"\")","v":""}]
["Bergerak",null,null,null,null,{"$f":"IF(ISNUMBER(SEARCH('UI Tenaga Listrik'!$E$7,'List Kota'!G8)),MAX($F$1:F7)+1,0)","v":0},"Bau-Bau - Sulawesi Tenggara",null,{"$f":"IFERROR(VLOOKUP(ROWS($I$1:I7),$F$2:$G$110,2,FALSE),\"\")","v":""}]
[null,null,null,null,null,{"$f":"IF(ISNUMBER(SEARCH('UI Tenaga Listrik'!$E$7,'List Kota'!G9)),MAX($F$1:F8)+1,0)","v":0},"Belitung - Bangka Belitung",null,{"$f":"IFERROR(VLOOKUP(ROWS($I$1:I8),$F$2:$G$110,2,FALSE),\"\")","v":""}]
["liter",null,null,null,null,{"$f":"IF(ISNUMBER(SEARCH('UI Tenaga Listrik'!$E$7,'List Kota'!G10)),MAX($F$1:F9)+1,0)","v":0},"Bengkalis - Riau",null,{"$f":"IFERROR(VLOOKUP(ROWS($I$1:I9),$F$2:$G$110,2,FALSE),\"\")","v":""}]
["kilogram",null,null,null,null,{"$f":"IF(ISNUMBER(SEARCH('UI Tenaga Listrik'!$E$7,'List Kota'!G11)),MAX($F$1:F10)+1,0)","v":0},"Biak - Papua",null,{"$f":"IFERROR(VLOOKUP(ROWS($I$1:I10),$F$2:$G$110,2,FALSE),\"\")","v":""}]
[null,null,null,null,null,{"$f":"IF(ISNUMBER(SEARCH('UI Tenaga Listrik'!$E$7,'List Kota'!G12)),MAX($F$1:F11)+1,0)","v":0},"Bima - NTB",null,{"$f":"IFERROR(VLOOKUP(ROWS($I$1:I11),$F$2:$G$110,2,FALSE),\"\")","v":""}]
[null,null,null,null,null,{"$f":"IF(ISNUMBER(SEARCH('UI Tenaga Listrik'!$E$7,'List Kota'!G13)),MAX($F$1:F12)+1,0)","v":0},"Bualemo - Sulawesi Tengah",null,{"$f":"IFERROR(VLOOKUP(ROWS($I$1:I12),$F$2:$G$110,2,FALSE),\"\")","v":""}]
[null,null,null,null,null,{"$f":"IF(ISNUMBER(SEARCH('UI Tenaga Listrik'!$E$7,'List Kota'!G14)),MAX($F$1:F13)+1,0)","v":0},"Buano - Maluku",null,{"$f":"IFERROR(VLOOKUP(ROWS($I$1:I13),$F$2:$G$110,2,FALSE),\"\")","v":""}]
[null,null,null,null,null,{"$f":"IF(ISNUMBER(SEARCH('UI Tenaga Listrik'!$E$7,'List Kota'!G15)),MAX($F$1:F14)+1,0)","v":0},"Buli - Maluku Utara",null,{"$f":"IFERROR(VLOOKUP(ROWS($I$1:I14),$F$2:$G$110,2,FALSE),\"\")","v":""}]
{"$rows_left_out":95}
{"sheet":"List BBM","index":14,"n_rows":52,"n_cols":14,"rows_kept":52,"cut":false,"hidden":true,"merged":[]}
["Energi Bergerak",null,null,{"$f":"COUNTIF(E:E,\"?*\")","v":18},null,null,null,null,"Energi Tidak Bergerak",null,null,null,{"$f":"COUNTIF(N:N,\"?*\")","v":46}]
[null,{"$f":"IF(ISNUMBER(SEARCH('UI Bahan Bakar'!$E$9,'List BBM'!C2)),MAX($B$1:B1,A2)+1,0)","v":1},"LNG/CNG",{"$f":"OFFSET($E$2,0,0,COUNTIF(E:E,\"?*\"),1)","v":"LNG/CNG"},{"$f":"IFERROR(VLOOKUP(ROWS($E$1:E1),$B$2:$C$19,2,FALSE),\"\")","v":"LNG/CNG"},null,null,null,null,null,{"$f":"IF(ISNUMBER(SEARCH('UI Bahan Bakar'!$E$11,'List BBM'!L2)),MAX($K$1:K1,J2)+1,0)","v":1},"Minyak Mentah",{"$f":"OFFSET($N$2,0,0,COUNTIF(N:N,\"?*\"),1)","v":"Minyak Mentah"},{"$f":"IFERROR(VLOOKUP(ROWS($N$1:N1),$K$2:$L$52,2,FALSE),\"\")","v":"Minyak Mentah"}]
[null,{"$f":"IF(ISNUMBER(SEARCH('UI Bahan Bakar'!$E$9,'List BBM'!C3)),MAX($B$1:B2,A3)+1,0)","v":2},"Premium",null,{"$f":"IFERROR(VLOOKUP(ROWS($E$1:E2),$B$2:$C$19,2,FALSE),\"\")","v":"Premium"},null,null,null,null,null,{"$f":"IF(ISNUMBER(SEARCH('UI Bahan Bakar'!$E$11,'List BBM'!L3)),MAX($K$1:K2,J3)+1,0)","v":2},"Orimulsion",null,{"$f":"IFERROR(VLOOKUP(ROWS($N$1:N2),$K$2:$L$52,2,FALSE),\"\")","v":"Orimulsion"}]
[null,{"$f":"IF(ISNUMBER(SEARCH('UI Bahan Bakar'!$E$9,'List BBM'!C4)),MAX($B$1:B3,A4)+1,0)","v":3},"Pertalite",null,{"$f":"IFERROR(VLOOKUP(ROWS($E$1:E3),$B$2:$C$19,2,FALSE),\"\")","v":"Pertalite"},null,null,null,null,null,{"$f":"IF(ISNUMBER(SEARCH('UI Bahan Bakar'!$E$11,'List BBM'!L4)),MAX($K$1:K3,J4)+1,0)","v":3},"LNG/CNG",null,{"$f":"IFERROR(VLOOKUP(ROWS($N$1:N3),$K$2:$L$52,2,FALSE),\"\")","v":"LNG/CNG"}]
[null,{"$f":"IF(ISNUMBER(SEARCH('UI Bahan Bakar'!$E$9,'List BBM'!C5)),MAX($B$1:B4,A5)+1,0)","v":4},"Pertamax",null,{"$f":"IFERROR(VLOOKUP(ROWS($E$1:E4),$B$2:$C$19,2,FALSE),\"\")","v":"Pertamax"},null,null,null,null,null,{"$f":"IF(ISNUMBER(SEARCH('UI Bahan Bakar'!$E$11,'List BBM'!L5)),MAX($K$1:K4,J5)+1,0)","v":4},"Premium",null,{"$f":"IFERROR(VLOOKUP(ROWS($N$1:N4),$K$2:$L$52,2,FALSE),\"\")","v":"Premium"}]
[null,{"$f":"IF(ISNUMBER(SEARCH('UI Bahan Bakar'!$E$9,'List BBM'!C6)),MAX($B$1:B5,A6)+1,0)","v":5},"Pertamax Plus/Turbo",null,{"$f":"IFERROR(VLOOKUP(ROWS($E$1:E5),$B$2:$C$19,2,FALSE),\"\")","v":"Pertamax Plus/Turbo"},null,null,null,null,null,{"$f":"IF(ISNUMBER(SEARCH('UI Bahan Bakar'!$E$11,'List BBM'!L6)),MAX($K$1:K5,J6)+1,0)","v":5},"Pertalite",null,{"$f":"IFERROR(VLOOKUP(ROWS($N$1:N5),$K$2:$L$52,2,FALSE),\"\")","v":"Pertalite"}]
[null,{"$f":"IF(ISNUMBER(SEARCH('UI Bahan Bakar'!$E$9,'List BBM'!C7)),MAX($B$1:B6,A7)+1,0)","v":6},"Avgas",null,{"$f":"IFERROR(VLOOKUP(ROWS($E$1:E6),$B$2:$C$19,2,FALSE),\"\")","v":"Avgas"},null,null,null,null,null,{"$f":"IF(ISNUMBER(SEARCH('UI Bahan Bakar'!$E$11,'List BBM'!L7)),MAX($K$1:K6,J7)+1,0)","v":6},"Pertamax",null,{"$f":"IFERROR(VLOOKUP(ROWS($N$1:N6),$K$2:$L$52,2,FALSE),\"\")","v":"Pertamax"}]
[null,{"$f":"IF(ISNUMBER(SEARCH('UI Bahan Bakar'!$E$9,'List BBM'!C8)),MAX($B$1:B7,A8)+1,0)","v":7},"Avtur",null,{"$f":"IFERROR(VLOOKUP(ROWS($E$1:E7),$B$2:$C$19,2,FALSE),\"\")","v":"Avtur"},null,null,null,null,null,{"$f":"IF(ISNUMBER(SEARCH('UI Bahan Bakar'!$E$11,'List BBM'!L8)),MAX($K$1:K7,J8)+1,0)","v":7},"Pertamax Plus/Turbo",null,{"$f":"IFERROR(VLOOKUP(ROWS($N$1:N7),$K$2:$L$52,2,FALSE),\"\")","v":"Pertamax Plus/Turbo"}]
[null,{"$f":"IF(ISNUMBER(SEARCH('UI Bahan Bakar'!$E$9,'List BBM'!C9)),MAX($B$1:B8,A9)+1,0)","v":8},"Kerosin Jet",null,{"$f":"IFERROR(VLOOKUP(ROWS($E$1:E8),$B$2:$C$19,2,FALSE),\"\")","v":"Kerosin Jet"},null,null,null,null,null,{"$f":"IF(ISNUMBER(SEARCH('UI Bahan Bakar'!$E$11,'List BBM'!L9)),MAX($K$1:K8,J9)+1,0)","v":8},"Avgas",null,{"$f":"IFERROR(VLOOKUP(ROWS($N$1:N8),$K$2:$L$52,2,FALSE),\"\")","v":"Avgas"}]
[null,{"$f":"IF(ISNUMBER(SEARCH('UI Bahan Bakar'!$E$9,'List BBM'!C10)),MAX($B$1:B9,A10)+1,0)","v":9},"Kerosin Lain",null,{"$f":"IFERROR(VLOOKUP(ROWS($E$1:E9),$B$2:$C$19,2,FALSE),\"\")","v":"Kerosin Lain"},null,null,null,null,null,{"$f":"IF(ISNUMBER(SEARCH('UI Bahan Bakar'!$E$11,'List BBM'!L10)),MAX($K$1:K9,J10)+1,0)","v":9},"Avtur",null,{"$f":"IFERROR(VLOOKUP(ROWS($N$1:N9),$K$2:$L$52,2,FALSE),\"\")","v":"Avtur"}]
[null,{"$f":"IF(ISNUMBER(SEARCH('UI Bahan Bakar'!$E$9,'List BBM'!C11)),MAX($B$1:B10,A11)+1,0)","v":10},"Solar",null,{"$f":"IFERROR(VLOOKUP(ROWS($E$1:E10),$B$2:$C$19,2,FALSE),\"\")","v":"Solar"},null,null,null,null,null,{"$f":"IF(ISNUMBER(SEARCH('UI Bahan Bakar'!$E$11,'List BBM'!L11)),MAX($K$1:K10,J11)+1,0)","v":10},"Kerosin Jet",null,{"$f":"IFERROR(VLOOKUP(ROWS($N$1:N10),$K$2:$L$52,2,FALSE),\"\")","v":"Kerosin Jet"}]
[null,{"$f":"IF(ISNUMBER(SEARCH('UI Bahan Bakar'!$E$9,'List BBM'!C12)),MAX($B$1:B11,A12)+1,0)","v":11},"Residu",null,{"$f":"IFERROR(VLOOKUP(ROWS($E$1:E11),$B$2:$C$19,2,FALSE),\"\")","v":"Residu"},null,null,null,null,null,{"$f":"IF(ISNUMBER(SEARCH('UI Bahan Bakar'!$E$11,'List BBM'!L12)),MAX($K$1:K11,J12)+1,0)","v":11},"Kerosin Lain",null,{"$f":"IFERROR(VLOOKUP(ROWS($N$1:N11),$K$2:$L$52,2,FALSE),\"\")","v":"Kerosin Lain"}]
[null,{"$f":"IF(ISNUMBER(SEARCH('UI Bahan Bakar'!$E$9,'List BBM'!C13)),MAX($B$1:B12,A13)+1,0)","v":12},"LPG",null,{"$f":"IFERROR(VLOOKUP(ROWS($E$1:E12),$B$2:$C$19,2,FALSE),\"\")","v":"LPG"},null,null,null,null,null,{"$f":"IF(ISNUMBER(SEARCH('UI Bahan Bakar'!$E$11,'List BBM'!L13)),MAX($K$1:K12,J13)+1,0)","v":12},"Shale oil",null,{"$f":"IFERROR(VLOOKUP(ROWS($N$1:N12),$K$2:$L$52,2,FALSE),\"\")","v":"Shale oil"}]
[null,{"$f":"IF(ISNUMBER(SEARCH('UI Bahan Bakar'!$E$9,'List BBM'!C14)),MAX($B$1:B13,A14)+1,0)","v":13},"Pelumas",null,{"$f":"IFERROR(VLOOKUP(ROWS($E$1:E13),$B$2:$C$19,2,FALSE),\"\")","v":"Pelumas"},null,null,null,null,null,{"$f":"IF(ISNUMBER(SEARCH('UI Bahan Bakar'!$E$11,'List BBM'!L14)),MAX($K$1:K13,J14)+1,0)","v":13},"Solar",null,{"$f":"IFERROR(VLOOKUP(ROWS($N$1:N13),$K$2:$L$52,2,FALSE),\"\")","v":"Solar"}]
[null,{"$f":"IF(ISNUMBER(SEARCH('UI Bahan Bakar'!$E$9,'List BBM'!C15)),MAX($B$1:B14,A15)+1,0)","v":14},"Refinery gas",null,{"$f":"IFERROR(VLOOKUP(ROWS($E$1:E14),$B$2:$C$19,2,FALSE),\"\")","v":"Refinery gas"},null,null,null,null,null,{"$f":"IF(ISNUMBER(SEARCH('UI Bahan Bakar'!$E$11,'List BBM'!L15)),MAX($K$1:K14,J15)+1,0)","v":14},"Residu",null,{"$f":"IFERROR(VLOOKUP(ROWS($N$1:N14),$K$2:$L$52,2,FALSE),\"\")","v":"Residu"}]
{"$rows_left_out":37}